mean radius,mean texture,mean perimeter,mean area,mean smoothness,mean compactness,mean concavity,mean concave points,mean symmetry,mean fractal dimension,radius error,texture error,perimeter error,area error,smoothness error,compactness error,concavity error,concave points error,symmetry error,fractal dimension error,worst radius,worst texture,worst perimeter,worst area,worst smoothness,worst compactness,worst concavity,worst concave points,worst symmetry,worst fractal dimension,target
,10.38,122.8,1001.0,0.1184,0.2776,0.3001,0.1471,0.2419,0.07871,1.095,,8.589,A,0.006399,,,0.01587,0.03003,0.006193,25.38,17.33,,2019.0,0.1622,0.6656,0.7119,0.2654,0.4601,0.1189,0
20.57,17.77,132.9,1326.0,,,0.0869,0.07017,,0.05667,0.5435,0.7339,3.398,A,0.005225,0.01308,,0.0134,,0.003532,24.99,23.41,158.8,1956.0,0.1238,0.1866,0.2416,0.186,0.275,,0
19.69,21.25,130.0,1203.0,0.1096,0.1599,,,,0.05999,0.7456,0.7869,4.585,A,0.00615,0.04006,0.03832,0.02058,,0.004571,23.57,25.53,,1709.0,0.1444,0.4245,0.4504,0.243,0.3613,0.08758,0
11.42,20.38,77.58,386.1,0.1425,0.2839,0.2414,,0.2597,0.09744,0.4956,1.156,,A,0.00911,0.07458,0.05661,0.01867,0.05963,0.009208,14.91,26.5,,567.7,0.2098,0.8663,0.6869,0.2575,0.6638,0.173,0
20.29,14.34,,,,0.1328,0.198,,0.1809,,0.7572,,5.438,,,0.02461,0.05688,0.01885,,0.005115,22.54,16.67,152.2,1575.0,0.1374,,0.4,0.1625,0.2364,0.07678,0
12.45,15.7,82.57,,0.1278,0.17,0.1578,,0.2087,0.07613,0.3345,,2.217,,0.00751,0.03345,0.03672,,0.02165,0.005082,15.47,23.75,103.4,741.6,0.1791,0.5249,0.5355,0.1741,0.3985,0.1244,0
18.25,,119.6,,,0.109,0.1127,0.074,0.1794,0.05742,0.4467,,,,0.004314,0.01382,0.02254,0.01039,,,22.88,27.66,153.2,1606.0,0.1442,0.2576,0.3784,0.1932,,0.08368,0
13.71,20.83,90.2,,,0.1645,0.09366,,0.2196,0.07451,0.5835,1.377,,A,0.008805,0.03029,,0.01448,0.01486,,17.06,28.14,110.6,897.0,0.1654,0.3682,0.2678,0.1556,0.3196,0.1151,0
13.0,21.82,87.5,519.8,0.1273,0.1932,0.1859,0.09353,0.235,0.07389,0.3063,,2.406,A,0.005731,,0.03553,0.01226,0.02143,,15.49,30.73,106.2,739.3,0.1703,0.5401,,0.206,0.4378,0.1072,0
,24.04,83.97,475.9,,0.2396,0.2273,0.08543,,0.08243,,1.599,,A,,,,0.01432,0.01789,0.01008,,40.68,97.65,711.4,0.1853,1.058,1.105,0.221,0.4366,0.2075,0
16.02,23.24,102.7,,0.08206,0.06669,,0.03323,0.1528,0.05697,0.3795,,2.466,A,0.004029,,,0.007591,0.0146,0.003042,19.19,33.88,,1150.0,,0.1551,0.1459,0.09975,,0.08452,0
15.78,17.89,103.6,781.0,,0.1292,0.09954,0.06606,0.1842,0.06082,0.5058,0.9849,,A,,0.04061,0.02791,0.01282,0.02008,,,,136.5,1299.0,,0.5609,0.3965,0.181,0.3792,0.1048,0
19.17,24.8,132.4,,,0.2458,0.2065,0.1118,0.2397,0.078,,3.568,,A,0.003139,,,0.0409,0.04484,0.01284,20.96,29.94,151.7,1332.0,0.1037,0.3903,0.3639,0.1767,0.3176,,0
15.85,23.95,103.7,782.7,0.08401,,0.09938,0.05364,,0.05338,0.4033,,,A,,0.03126,,0.01992,0.02981,,,27.66,112.0,876.5,0.1131,,,0.1119,0.2809,0.06287,0
13.73,22.61,93.6,578.3,0.1131,0.2293,,0.08025,0.2069,0.07682,0.2121,1.169,,,0.006429,0.05936,0.05501,0.01628,0.01961,0.008093,15.03,32.01,108.8,697.7,0.1651,0.7725,,0.2208,0.3596,0.1431,0
14.54,27.54,96.73,,0.1139,0.1595,0.1639,,0.2303,0.07077,0.37,,2.879,A,0.005607,0.0424,,,0.01857,0.005466,17.46,,124.1,943.2,0.1678,0.6577,,,0.4218,0.1341,0
14.68,20.13,94.74,684.5,,0.072,0.07395,,0.1586,0.05922,0.4727,,3.195,A,0.005718,,0.01998,0.01109,0.0141,,,30.88,123.4,1138.0,0.1464,0.1871,0.2914,0.1609,0.3029,,0
,20.68,108.1,798.8,,,0.1722,0.1028,0.2164,0.07356,0.5692,1.073,3.854,,0.007026,,,0.01297,0.01689,0.004142,20.96,31.48,136.8,1315.0,0.1789,0.4233,0.4784,0.2073,0.3706,0.1142,0
19.81,22.15,130.0,1260.0,0.09831,0.1027,0.1479,0.09498,0.1582,0.05395,0.7582,1.017,,,0.006494,,,0.01521,0.01356,0.001997,,30.88,186.8,2398.0,0.1512,0.315,0.5372,0.2388,0.2768,0.07615,0
13.54,14.36,87.46,,0.09779,0.08129,0.06664,0.04781,0.1885,0.05766,0.2699,0.7886,2.058,A,0.008462,0.0146,0.02387,0.01315,,,15.11,19.26,99.7,711.2,0.144,0.1773,0.239,0.1288,0.2977,0.07259,1
13.08,15.71,85.63,520.0,0.1075,0.127,0.04568,0.0311,0.1967,0.06811,0.1852,0.7477,1.383,A,0.004097,0.01898,,0.00649,0.01678,0.002425,14.5,20.49,96.09,630.5,0.1312,0.2776,0.189,0.07283,,0.08183,1
9.504,12.44,60.34,273.9,0.1024,0.06492,0.02956,0.02076,0.1815,0.06905,0.2773,,1.909,,0.009606,0.01432,0.01985,0.01421,0.02027,0.002968,10.23,15.66,,314.9,0.1324,,0.08867,0.06227,0.245,0.07773,1
15.34,14.26,102.5,704.4,,0.2135,0.2077,0.09756,0.2521,0.07032,0.4388,,3.384,A,0.006789,0.05328,0.06446,0.02252,0.03672,0.004394,,19.08,,980.9,0.139,0.5954,,0.2393,0.4667,0.09946,0
21.16,23.04,137.2,,0.09428,0.1022,0.1097,0.08632,0.1769,0.05278,0.6917,1.127,,,0.004728,0.01259,,0.01038,0.01083,,29.17,35.59,188.0,2615.0,0.1401,,0.3155,0.2009,0.2822,0.07526,0
16.65,,110.0,904.6,0.1121,0.1457,,,0.1995,0.0633,0.8068,0.9017,5.455,A,,0.01882,,0.0113,0.01468,0.002801,26.46,,177.0,2215.0,0.1805,0.3578,0.4695,0.2095,0.3613,,0
17.14,16.4,116.0,912.7,0.1186,,0.2229,,,0.07413,1.046,0.976,7.276,,0.008029,,0.03732,0.02397,0.02308,0.007444,22.25,21.4,,,0.1545,0.3949,0.3853,0.255,0.4066,,0
14.58,21.53,97.41,644.8,0.1054,0.1868,0.1425,,,0.06924,0.2545,0.9832,2.11,A,,0.03055,0.02681,0.01352,,0.003711,17.62,,122.4,896.9,0.1525,0.6643,0.5539,0.2701,0.4264,0.1275,0
18.61,20.25,122.1,,,0.1066,,,0.1697,0.05699,0.8529,1.849,5.632,A,0.01075,0.02722,,0.01911,0.02293,,,,139.9,1403.0,0.1338,0.2117,,0.149,0.2341,0.07421,0
15.3,25.27,102.4,732.4,,0.1697,,0.08751,0.1926,0.0654,0.439,1.012,3.498,A,0.005233,0.03057,,0.01083,0.01768,0.002967,20.27,36.71,149.3,1269.0,0.1641,,0.6335,0.2024,0.4027,0.09876,0
,15.05,115.0,955.1,,0.1157,0.09875,,0.1739,0.06149,0.6003,0.8225,4.655,A,0.005627,0.03033,0.03407,0.01354,,,20.01,19.52,,1227.0,0.1255,0.2812,0.2489,0.1456,0.2756,,0
18.63,25.11,124.8,1088.0,,0.1887,0.2319,,0.2183,0.06197,0.8307,1.466,,A,0.006248,,0.05196,0.01158,0.02007,0.00456,23.15,34.01,160.5,1670.0,0.1491,0.4257,0.6133,0.1848,0.3444,0.09782,0
11.84,18.7,77.93,,0.1109,0.1516,0.1218,0.05182,0.2301,0.07799,,1.03,,A,0.005551,0.03414,0.04205,0.01044,0.02273,,16.82,28.12,119.4,888.7,0.1637,,0.6956,0.1546,0.4761,0.1402,0
17.02,23.98,112.8,899.3,0.1197,0.1496,0.2417,0.1203,,0.06382,0.6009,1.398,3.999,A,0.008268,0.03082,,,0.02102,,,32.09,136.1,1344.0,0.1634,0.3559,0.5588,0.1847,0.353,0.08482,0
19.27,26.47,127.9,1162.0,0.09401,,0.1657,,,0.06261,0.5558,0.6062,,A,0.005015,0.03318,,0.009643,0.01543,,24.15,30.9,,1813.0,0.1509,0.659,0.6091,0.1785,0.3672,0.1123,0
,17.88,107.0,807.2,0.104,0.1559,0.1354,0.07752,0.1998,,0.334,0.6857,2.183,A,,0.02868,0.02664,0.009067,,0.003817,20.21,,132.7,1261.0,0.1446,0.5804,0.5274,0.1864,,0.1233,0
16.74,21.59,110.1,,0.0961,0.1336,0.1348,0.06018,0.1896,0.05656,0.4615,,3.008,,0.005776,,0.03695,0.01195,0.02789,0.002665,,29.02,133.5,1229.0,0.1563,0.3835,0.5409,0.1813,0.4863,0.08633,0
14.25,21.72,,633.0,,0.1098,0.1319,0.05598,0.1885,0.06125,0.286,,,A,0.005878,,,0.01161,0.02028,0.004022,15.89,,116.2,799.6,0.1446,,0.5186,,0.3591,,0
13.03,18.42,82.61,523.8,0.08983,0.03766,0.02562,,0.1467,0.05863,0.1839,,1.17,A,0.004352,0.004899,0.01343,0.01164,0.02671,,13.3,22.81,,545.9,0.09701,0.04619,0.04833,0.05013,0.1987,0.06169,1
,25.2,95.54,698.8,0.09387,0.05131,0.02398,,0.1565,0.05504,1.214,,8.077,A,0.006883,,,0.01917,0.007882,,14.99,25.2,95.54,698.8,0.09387,0.05131,0.02398,0.02899,,0.05504,0
13.48,20.82,88.4,559.2,0.1016,0.1255,0.1063,0.05439,0.172,0.06419,0.213,,,A,0.005367,0.02239,0.03049,0.01262,0.01377,,15.53,26.02,,,0.161,,0.503,0.2258,0.2807,0.1071,0
,21.58,86.18,,,,0.0311,0.02031,0.1784,,,,,A,0.00328,0.01102,0.0139,0.006881,0.0138,0.001286,15.93,30.25,102.5,787.9,0.1094,0.2043,0.2085,0.1112,0.2994,0.07146,0
,,,,0.1227,0.1218,0.1044,0.05669,0.1895,0.0687,,1.428,1.822,A,0.008064,0.01764,0.02595,0.01037,0.01357,,12.84,35.34,87.22,514.0,0.1909,0.2698,0.4023,0.1424,0.2964,,0
19.07,24.81,128.3,1104.0,0.09081,0.219,0.2107,,0.231,0.06343,,,8.83,A,,0.1006,,0.02638,,,24.09,33.17,177.4,1651.0,0.1247,0.7444,0.7242,0.2493,0.467,0.1038,0
13.28,20.28,87.32,545.2,0.1041,0.1436,0.09847,0.06158,0.1974,0.06782,0.3704,0.8249,,A,0.005072,0.02147,,0.00956,0.01719,0.003317,17.38,28.0,,907.2,,0.3724,0.3664,0.1492,0.3739,0.1027,0
13.17,21.81,85.42,,0.09714,0.1047,0.08259,,0.1746,0.06177,0.1938,0.6123,1.334,,0.00335,0.01384,0.01452,0.006853,0.01113,0.00172,16.23,,105.5,,0.1503,0.3904,0.3728,0.1607,,0.09618,0
18.65,17.6,123.7,1076.0,0.1099,0.1686,0.1974,0.1009,,0.06049,,,4.293,A,0.006294,0.03994,0.05554,0.01695,,0.003535,,21.32,,1567.0,0.1679,0.509,0.7345,0.2378,0.3799,0.09185,0
8.196,16.84,51.71,,0.086,0.05943,0.01588,,0.1769,0.06503,0.1563,,,A,0.008968,0.01646,0.01588,0.005917,0.02574,0.002582,8.964,21.96,57.26,242.2,0.1297,0.1357,0.0688,,0.3105,0.07409,1
,,85.98,,0.1158,0.1231,0.1226,,0.2128,0.06777,0.2871,0.8937,1.897,A,,0.02336,0.02905,,0.01743,0.003643,15.67,27.95,102.8,759.4,0.1786,0.4166,0.5006,0.2088,0.39,0.1179,0
12.05,14.63,78.04,449.3,,,,0.02749,0.1675,0.06043,,0.7294,1.848,A,0.005488,,0.02322,0.00566,0.01428,0.002422,13.76,20.7,89.88,582.6,0.1494,0.2156,0.305,0.06548,0.2747,0.08301,1
,,86.91,561.0,0.08752,0.07698,0.04751,0.03384,,0.05718,0.2338,,1.735,A,0.004455,0.01382,0.02095,0.01184,,,15.15,31.82,99.0,698.8,0.1162,0.1711,0.2282,0.1282,,,1
11.76,21.6,74.72,,,0.04966,0.01657,0.01115,,0.05888,,,2.635,,0.005857,0.009758,0.01168,,0.02406,,12.98,25.72,82.98,516.5,0.1085,0.08615,0.05523,0.03715,0.2433,0.06563,1
13.64,16.34,87.21,,,0.06059,0.01857,0.01723,0.1353,0.05953,0.1872,0.9234,1.449,A,0.004477,0.01177,0.01079,0.007956,0.01325,,14.67,23.19,96.08,656.7,0.1089,0.1582,0.105,0.08586,0.2346,0.08025,1
11.94,18.24,75.71,437.6,0.08261,0.04751,,0.01349,,0.0611,0.2273,0.6329,,A,0.00721,0.00838,,0.008,,0.002635,,21.33,83.67,527.2,0.1144,0.08906,0.09203,0.06296,0.2785,,1
18.22,18.7,120.3,1033.0,0.1148,0.1485,0.1772,,0.2092,0.0631,0.8337,1.593,,A,0.003899,0.02961,0.02817,0.009222,,0.005126,20.6,24.13,135.1,1321.0,,0.2297,0.2623,0.1325,0.3021,0.07987,0
15.1,22.02,97.26,712.8,,0.07081,0.05253,,,0.05684,0.3105,0.8339,2.097,A,0.004675,0.0103,0.01603,0.009222,0.01095,0.001629,18.1,31.69,117.7,1030.0,0.1389,,0.2712,,0.2675,0.07873,0
11.52,18.75,73.34,409.0,,0.05473,0.03036,0.02278,,0.05907,0.3249,0.9591,,,0.008328,,0.01349,0.00867,0.03218,0.002386,12.84,22.47,81.81,506.2,0.1249,,0.09076,,0.3306,0.07036,1
19.21,18.57,125.5,,0.1053,0.1267,0.1323,0.08994,,0.05961,0.7275,1.193,,A,,0.02306,0.02945,0.01538,0.01852,0.002608,26.14,28.14,170.1,,0.1624,0.3511,0.3879,0.2091,,0.08294,0
14.71,21.59,95.55,,0.1137,0.1365,0.1293,0.08123,0.2027,0.06758,0.4226,,,A,0.003659,0.02855,0.02572,0.01272,,0.004108,17.87,30.7,115.7,985.5,0.1368,0.429,0.3587,0.1834,0.3698,0.1094,0
13.05,19.31,82.61,527.2,0.0806,0.03789,0.000692,0.004167,0.1819,0.05501,0.404,1.214,2.595,,,0.008593,0.000692,0.004167,0.0219,0.00299,14.23,22.25,90.24,624.1,0.1021,0.06191,0.001845,0.01111,,,1
8.618,11.79,54.34,224.5,0.09752,0.05272,,0.007799,0.1683,0.07187,0.1559,0.5796,1.046,A,,0.01055,0.01981,0.005742,0.0209,0.002788,9.507,,59.9,274.9,0.1733,0.1239,0.1168,0.04419,,0.09026,1
10.17,14.88,64.55,,0.1134,0.08061,,0.0129,0.2743,0.0696,0.5158,,3.312,A,0.007514,0.01099,,,0.04183,0.005953,11.02,17.45,69.86,368.6,0.1275,0.09866,0.02168,0.02579,,0.0802,1
8.598,20.98,54.66,,0.1243,0.08963,0.03,,0.1828,0.06757,0.3582,2.067,,A,0.01193,,0.03,0.009259,0.03357,0.003048,9.565,,,273.9,,0.1698,0.09001,0.02778,0.2972,0.07712,1
14.25,22.15,96.42,645.7,,,0.2135,,0.1949,0.07292,0.7036,1.268,5.373,A,0.009407,,0.06899,0.01848,0.017,0.006113,17.67,29.51,119.1,959.5,0.164,0.6247,0.6922,0.1785,,,0
9.173,13.86,59.2,260.9,0.07721,0.08751,0.05988,0.0218,0.2341,0.06963,0.4098,,2.608,A,0.008738,0.03938,0.04312,0.0156,0.04192,0.005822,10.01,19.23,65.59,310.1,0.09836,0.1678,0.1397,,0.3282,0.0849,1
12.68,23.84,82.69,499.0,0.1122,0.1262,0.1128,0.06873,0.1905,0.0659,0.4255,1.178,,A,0.007781,0.02648,0.02973,,0.01635,0.003601,17.09,,111.8,,,0.4061,0.4024,0.1716,,0.1031,0
,,97.4,,,0.1479,0.1267,0.09029,0.1953,0.06654,,1.281,,A,0.006703,0.0231,0.02315,0.01184,0.019,0.003224,17.31,,,925.1,0.1648,0.3416,,0.1614,0.3321,0.08911,0
,21.01,60.11,,0.1044,0.07773,0.02172,0.01504,0.1717,0.06899,,,1.66,A,,0.01755,0.01714,0.009333,0.02279,0.004237,10.41,,,330.7,0.1548,0.1664,0.09412,0.06517,0.2878,0.09211,1
,19.04,71.8,394.1,0.08139,0.04701,,0.0223,0.1516,0.05667,0.2727,0.9429,,A,0.009282,0.009216,0.02063,0.008965,0.02183,0.002146,,23.84,78.0,466.7,0.129,0.09148,0.1444,0.06961,,0.06641,1
9.029,17.33,58.79,250.5,0.1066,0.1413,0.313,,0.2111,,0.3274,1.194,1.885,A,0.009549,0.08606,0.3038,0.03322,0.04197,0.009559,10.31,22.65,65.5,,0.1482,0.4365,1.252,0.175,,0.1175,1
,16.49,81.37,502.5,,0.05234,0.03653,0.02864,0.159,0.05653,0.2368,,,A,0.007962,,,0.008662,0.02254,0.001906,13.46,19.76,85.67,554.9,0.1296,0.07061,0.1039,0.05882,0.2383,0.0641,1
18.94,21.31,,1130.0,,0.1029,0.108,0.07951,0.1582,0.05461,0.7888,,5.486,A,,0.01652,0.02269,0.0137,0.01386,,24.86,26.58,165.9,1866.0,0.1193,0.2336,0.2687,0.1789,,0.06589,0
8.888,14.64,58.79,244.0,0.09783,0.1531,,0.02872,0.1902,0.0898,0.5262,0.8522,3.168,A,0.01721,0.09368,,,0.02541,,9.733,15.67,,284.4,0.1207,,0.1434,0.04786,0.2254,,1
17.2,24.52,114.2,,0.1071,0.183,0.1692,0.07944,0.1927,0.06487,0.5907,1.041,3.705,A,,0.05616,0.04252,0.01127,0.01527,,23.32,33.82,151.6,1681.0,0.1585,0.7394,0.6566,0.1899,,0.1339,0
13.8,15.79,90.43,584.1,0.1007,0.128,0.07789,0.05069,0.1662,0.06566,,,,,0.004717,0.02065,0.01759,0.009206,0.0122,0.00313,16.57,,110.3,812.4,0.1411,0.3542,0.2779,0.1383,,,0
12.31,16.52,79.19,,,0.06829,0.03372,0.02272,0.172,,0.2505,1.025,,A,0.004854,0.01819,0.01826,,,0.002304,14.11,23.21,89.71,611.1,0.1176,0.1843,0.1703,0.0866,0.2618,,1
16.07,19.65,,,0.09168,0.08424,0.09769,0.06638,,0.05391,0.7474,1.016,,A,,0.02203,,0.01809,0.0155,0.001948,19.77,24.56,128.8,1223.0,,0.2045,0.2829,0.152,0.265,,0
13.53,10.94,87.91,559.2,0.1291,0.1047,0.06877,0.06556,0.2403,,0.4101,1.014,2.652,,0.0134,0.02839,0.01162,0.008239,0.02572,0.006164,,12.49,91.36,605.5,0.1451,,0.08539,0.07407,0.271,,1
18.05,16.15,120.2,1006.0,,0.2146,0.1684,0.108,0.2152,0.06673,,0.5505,6.311,A,0.00794,0.05839,,0.0207,0.02591,,22.39,18.91,150.1,1610.0,0.1478,0.5634,0.3786,0.2102,0.3751,0.1108,0
20.18,23.97,143.7,1245.0,0.1286,0.3454,0.3754,,0.2906,0.08142,0.9317,1.885,8.649,A,0.01038,0.06835,,0.02593,0.07895,0.005987,23.37,31.72,170.3,1623.0,0.1639,0.6164,0.7681,0.2508,0.544,0.09964,0
12.86,,83.19,506.3,0.09934,0.09546,0.03889,0.02315,,0.05997,0.2655,1.095,1.778,A,0.005293,0.01661,0.02071,0.008179,0.01748,,14.24,,91.88,622.1,0.1289,0.2141,,0.07926,0.2779,0.07918,1
11.45,,73.81,401.5,,0.09362,,0.02233,0.1842,0.07005,0.3251,2.174,,A,0.01037,,,0.007506,0.01816,0.003976,13.11,32.16,84.53,525.1,0.1557,0.1676,0.1755,0.06127,0.2762,0.08851,1
13.34,,86.49,520.0,0.1078,0.1535,0.1169,,,0.06902,0.286,1.016,1.535,A,0.006794,0.03575,,0.01383,0.02134,0.004603,15.53,23.19,96.66,614.9,,0.4791,0.4858,,,0.1016,1
25.22,24.91,,1878.0,0.1063,0.2665,0.3339,,,0.06782,0.8973,1.474,7.382,A,,,0.0573,0.0203,0.01065,0.005893,30.0,,211.7,2562.0,0.1573,0.6076,0.6476,0.2867,0.2355,0.1051,0
19.1,26.29,129.1,,0.1215,0.1791,0.1937,0.1469,0.1634,0.07224,0.519,2.91,5.801,A,,0.0605,0.02134,,0.03056,0.01039,20.33,32.72,141.3,1298.0,0.1392,,0.2432,0.1841,0.2311,0.09203,0
12.0,15.65,76.95,,,,0.04151,0.01863,0.2079,0.05968,0.2271,1.255,1.441,A,0.005969,0.01812,,0.007027,,0.002607,13.67,24.9,87.78,567.9,0.1377,0.2003,0.2267,0.07632,0.3379,0.07924,1
,18.52,121.1,1075.0,0.09874,0.1053,0.1335,0.08795,0.2132,0.06022,0.6997,1.475,4.782,A,0.006471,0.01649,0.02806,0.0142,0.0237,0.003755,,27.68,,1603.0,0.1398,0.2089,0.3157,0.1642,0.3695,,0
14.48,21.46,,,,0.09947,0.1204,0.04938,0.2075,0.05636,0.4204,,,A,0.009369,0.02983,0.05371,0.01761,0.02418,0.003249,16.21,29.25,108.4,808.9,,0.1976,0.3349,0.1225,0.302,0.06846,0
19.02,,122.0,1076.0,0.09029,0.1206,0.1468,,0.1953,0.05629,0.5495,0.6636,3.055,,0.003872,0.01842,,0.012,0.01964,0.003337,24.56,30.41,,1623.0,0.1249,0.3206,0.5755,0.1956,0.3956,0.09288,0
12.36,21.8,79.78,466.1,,0.09445,0.06015,0.03745,0.193,,0.2978,1.502,2.203,A,0.007112,0.02493,,0.01293,0.01958,,13.83,30.5,91.46,574.7,,0.2463,,0.1205,0.2972,,1
14.64,15.24,95.77,,0.1132,0.1339,0.09966,0.07064,0.2116,0.06346,,0.7372,,A,0.005508,0.04412,0.04436,0.01623,0.02427,,16.34,18.24,109.4,803.6,0.1277,,0.2604,0.1397,,0.08473,1
,,94.57,662.7,,0.08606,0.03102,,0.1685,0.05866,0.3721,,2.279,A,0.004868,0.01818,0.01121,0.008606,0.02085,0.002893,16.11,,102.9,803.7,0.1115,0.1766,0.09189,0.06946,,,1
15.37,22.76,,728.2,0.092,0.1036,0.1122,0.07483,0.1717,0.06097,0.3129,0.8413,2.075,,,0.02444,0.04531,0.01763,0.02471,0.002142,,25.84,107.5,830.9,0.1257,0.1997,0.2846,0.1476,,0.06828,0
,14.76,84.74,551.7,0.07355,0.05055,,,,0.05318,0.4057,,,A,0.004481,,0.01358,0.01082,0.01069,,,,104.5,830.6,0.1006,0.1238,0.135,0.1001,0.2027,0.06206,1
13.45,18.3,86.6,,0.1022,,0.03974,,,0.0571,0.295,,,A,0.005884,0.01491,0.01872,0.009366,0.01884,0.001817,15.1,25.94,97.59,699.4,0.1339,0.1751,0.1381,0.07911,,0.06603,1
15.06,,100.3,705.6,0.1039,,0.17,0.08815,0.1855,0.06284,,,3.706,A,0.00925,0.03715,0.04867,0.01851,,0.00352,18.23,24.23,123.5,1025.0,0.1551,0.4203,0.5203,0.2115,0.2834,0.08234,0
20.26,23.03,132.4,,0.09078,,0.1465,0.08683,0.2095,0.05649,0.7576,1.509,4.554,A,0.006016,,0.04232,0.01269,,0.004411,24.22,31.59,156.1,1750.0,0.119,0.3539,0.4098,0.1573,0.3689,0.08368,0
12.18,17.84,77.79,451.1,,0.07057,,,,,0.3661,1.511,,A,0.005433,0.01179,0.01131,,0.0222,0.003408,12.83,20.92,82.14,495.2,0.114,0.09358,0.0498,0.05882,,0.07376,1
9.787,19.94,62.11,,,,,0.007937,0.135,0.0689,0.335,2.043,2.132,A,,0.01463,,0.00525,0.01801,0.005667,10.92,26.29,68.81,366.1,,0.09473,0.02049,0.02381,0.1934,,1
11.6,,74.34,412.6,,0.07525,0.04196,,0.162,0.06582,0.2315,0.5391,1.475,A,0.006153,0.0133,0.01693,0.006884,0.01651,0.002551,13.06,,82.96,,0.1431,,0.1922,0.08449,0.2772,0.08756,1
14.42,19.77,94.48,642.5,,,0.09388,0.05839,0.1879,,0.2895,1.851,2.376,A,0.008005,0.02895,,0.01424,0.01462,0.004452,16.33,30.86,109.5,826.4,0.1431,0.3026,0.3194,0.1565,,0.09353,0
13.61,,88.05,,0.09488,0.08511,0.08625,0.04489,0.1609,0.05871,0.4565,1.29,,A,0.005872,0.01488,0.02647,0.009921,0.01465,,,35.27,,906.5,,0.1943,0.3169,0.1184,0.2651,,0
6.981,,43.79,143.5,,0.07568,0.0,,0.193,0.07818,0.2241,1.508,1.553,A,0.01019,0.01084,0.0,0.0,0.02659,0.0041,7.93,19.54,,185.2,0.1584,0.1202,0.0,0.0,,0.09382,1
12.18,,77.22,458.7,0.08013,,,,0.1739,0.05677,,1.571,,A,0.00508,0.006098,0.01069,0.006797,0.01447,0.001532,13.34,32.84,84.58,547.8,0.1123,0.08862,0.1145,0.07431,,0.06878,1
9.876,19.4,63.95,298.3,0.1005,0.09697,,0.03029,0.1945,0.06322,0.1803,,,,0.009058,0.02196,0.03029,0.01112,,0.00357,,26.83,,361.2,0.1559,0.2302,0.2644,0.09749,0.2622,0.0849,1
10.49,19.29,67.41,,0.09989,0.08578,0.02995,0.01201,0.2217,,0.355,1.534,2.302,A,0.007595,0.02219,0.0288,0.008614,,,11.54,,74.22,402.8,0.1219,0.1486,0.07987,0.03203,0.2826,0.07552,1
13.11,15.56,87.21,530.2,0.1398,0.1765,0.2071,0.09601,0.1925,0.07692,0.3908,,2.41,,0.007162,0.02912,,,0.01547,,16.31,22.4,106.4,827.2,,0.4099,0.6376,0.1986,,0.1405,0
11.64,18.33,75.17,412.5,,0.1017,0.0707,0.03485,0.1801,0.0652,0.306,,2.155,,0.00854,0.0231,,0.01398,0.01565,,13.14,29.26,85.51,521.7,,0.266,0.2873,0.1218,0.2806,0.09097,1
12.36,18.54,,,0.08477,0.06815,0.02643,0.01921,0.1602,0.06066,0.1199,0.8944,,A,0.003457,0.01047,,0.005558,0.01251,0.001356,,,85.56,544.1,0.1184,0.1963,0.1937,0.08442,0.2983,0.07185,1
22.27,19.67,152.8,,0.1326,0.2768,0.4264,0.1823,0.2556,0.07039,,,,A,0.006515,0.08668,,0.0248,,0.005037,28.4,28.01,206.8,2360.0,0.1701,0.6997,0.9608,0.291,,0.09789,0
11.34,21.26,72.48,,0.08759,0.06575,0.05133,,0.1487,0.06529,0.2344,0.9861,1.597,A,0.009113,,0.02443,0.006435,0.01568,0.002477,13.01,29.15,83.99,,0.1699,0.2196,,0.08278,0.2829,,1
9.777,16.99,62.5,290.2,,0.08404,0.04334,,0.1584,0.07065,0.403,1.424,,A,0.01385,0.02932,0.02722,0.01023,0.03281,,11.05,21.47,71.68,367.0,0.1467,,0.13,0.05334,0.2533,0.08468,1
,,,,,0.1209,0.1065,0.06021,,0.0707,0.3424,1.803,,A,0.01291,0.04042,0.05101,0.02295,0.02144,,13.33,25.47,89.0,527.4,0.1287,0.225,0.2216,0.1105,0.2226,,1
14.26,19.65,97.83,629.9,0.07837,0.2233,0.3003,,0.1704,,,1.49,,A,0.005298,,,0.02292,0.02566,0.01298,15.3,23.73,107.0,709.0,0.08949,,0.6783,0.1505,0.2398,0.1082,1
10.51,20.19,68.64,334.2,0.1122,0.1303,,0.03068,0.1922,0.07782,0.3336,1.86,,A,0.01188,,0.04591,0.01544,0.02287,0.006792,,22.75,72.62,374.4,0.13,0.2049,0.1295,0.06136,,0.09026,1
8.726,15.83,,,0.115,0.08201,0.04132,0.01924,0.1649,0.07633,0.1665,0.5864,1.354,A,0.008261,0.02213,0.03259,0.0104,0.01708,,9.628,,64.48,,0.1724,0.2364,0.2456,0.105,0.2926,0.1017,1
11.93,21.53,76.53,438.6,,0.07849,0.03328,0.02008,,0.06194,,0.9227,2.0,A,0.007803,0.02507,0.01835,0.007711,0.01278,0.003856,13.67,26.15,87.54,583.0,0.15,0.2399,0.1503,0.07247,0.2438,0.08541,1
8.95,15.76,58.74,245.2,,,0.09263,0.02308,0.1305,,,0.9789,3.28,,0.01835,0.0676,0.09263,0.02308,0.02384,0.005601,,17.07,63.34,270.0,0.1179,0.1879,0.1544,0.03846,0.1652,0.07722,1
14.87,16.67,98.64,,0.1162,0.1649,0.169,0.08923,,0.06768,0.4266,0.9489,2.989,A,,0.02563,,,0.01602,,18.81,27.37,127.1,,0.1878,0.448,0.4704,0.2027,0.3585,0.1065,0
15.78,22.91,,782.6,,0.1752,0.2133,0.09479,0.2096,0.07331,0.552,1.072,3.598,A,0.008699,0.03976,0.0595,0.0139,0.01495,0.005984,,30.5,130.3,1272.0,,,0.7356,0.2034,0.3274,0.1252,0
,,114.2,982.0,0.08402,0.06722,0.07293,,0.2129,0.05025,0.5506,1.214,,A,0.004024,0.008422,0.02291,0.009863,,,20.58,27.83,129.2,1261.0,0.1072,0.1202,,0.1185,0.4882,0.06111,0
,,73.34,,0.09373,,0.03512,0.02623,0.1667,0.06113,0.1408,0.4607,1.103,A,0.00604,0.01529,,0.00646,0.01344,0.002206,12.82,15.97,83.74,510.5,0.1548,,0.2102,,0.3016,0.08523,1
18.66,17.12,121.4,1077.0,0.1054,0.11,0.1457,,0.1966,,0.7128,1.581,,A,,0.02101,,0.01601,0.02045,0.00457,22.25,24.9,145.4,1549.0,0.1503,0.2291,0.3272,0.1674,,0.08456,0
24.25,,,1761.0,,0.2867,0.4268,0.2012,0.2655,0.06877,1.509,3.12,9.807,B,0.02333,0.09806,0.1278,0.01822,,0.009875,26.02,,180.9,2073.0,0.1696,0.4244,0.5803,0.2248,0.3222,,0
14.5,10.89,,640.7,0.1101,0.1099,,0.05778,0.1856,0.06402,0.2929,0.857,1.928,A,0.003818,,0.02882,0.012,0.0191,0.002808,15.7,,,745.5,0.1313,0.1788,0.256,0.1221,0.2889,,1
,16.39,86.1,553.5,0.07115,0.07325,0.08092,,0.1422,0.05823,0.1639,1.14,,A,0.005919,0.0327,0.04957,0.01038,0.01208,0.004076,14.26,,,632.1,,,0.3308,0.08978,0.2048,0.07628,1
13.85,17.21,,588.7,0.08785,0.06136,0.0142,,0.1614,0.0589,0.2185,0.8561,1.495,A,0.004599,0.009169,,0.004814,0.01247,0.001708,15.49,23.58,100.3,725.9,0.1157,0.135,0.08115,,,0.07182,1
13.61,24.69,87.76,,0.09258,0.07862,,,0.1761,0.0613,0.231,1.005,1.752,A,0.004088,0.01174,,0.00688,0.01323,0.001465,16.89,35.64,113.2,848.7,0.1471,0.2884,0.3796,0.1329,0.347,,0
19.0,18.91,123.4,1138.0,0.08217,,0.09271,0.05627,0.1946,0.05044,0.6896,,5.216,A,,0.02731,0.0404,0.01361,0.0203,0.002686,22.32,25.73,148.2,1538.0,0.1021,,0.3207,0.1218,0.2841,0.06541,0
15.1,16.39,99.58,674.5,0.115,0.1807,0.1138,0.08534,0.2001,0.06467,0.4309,1.068,2.796,A,0.009006,0.04185,0.03204,0.02258,0.02353,0.004984,16.11,18.33,105.9,762.6,0.1386,0.2883,0.196,0.1423,,0.07779,1
19.79,25.12,130.4,1192.0,0.1015,0.1589,0.2545,0.1149,,0.06113,0.4953,1.199,2.765,A,,0.03179,,0.01043,0.01578,0.003224,,33.58,148.7,1589.0,0.1275,0.3861,0.5673,0.1732,,0.08465,0
12.19,,79.08,455.8,0.1066,0.09509,0.02855,,0.188,0.06471,0.2005,0.8163,,A,0.006773,0.02456,,0.008094,0.02662,0.004143,13.34,17.81,91.38,545.2,0.1427,0.2585,0.09915,0.08187,0.3469,,1
15.46,19.48,101.7,,0.1092,0.1223,,,0.1931,0.05796,0.4743,0.7859,3.094,A,0.00624,0.01484,0.02813,0.01093,0.01397,,19.26,26.0,,1156.0,0.1546,0.2394,0.3791,,0.2837,0.08019,0
,21.54,106.2,809.8,0.1008,0.1284,0.1043,0.05613,0.216,0.05891,,1.265,2.844,A,0.004877,0.01952,0.02219,0.009231,,,19.47,,129.7,,,0.3055,,0.1312,,0.07619,0
15.71,13.93,102.0,761.7,,0.09462,0.07135,,0.1816,0.05723,0.3117,0.8155,1.972,A,0.005217,0.01515,0.01678,0.01268,0.01669,0.00233,17.5,19.25,114.3,922.8,0.1223,0.1949,0.1709,0.1374,0.2723,0.07071,1
18.45,21.91,120.2,1075.0,0.0943,0.09709,0.1153,0.06847,0.1692,0.05727,0.5959,1.202,,A,0.006001,,,0.009148,,0.002205,22.52,,145.6,1590.0,0.1465,0.2275,0.3965,,0.3109,0.0761,0